ФЛОТИЛИЯ
type: LexicalConcept
association1: http://lod.ruthes.org/resource/concept/3891
holonym: http://lod.ruthes.org/resource/concept/775
hypernym: http://lod.ruthes.org/resource/concept/106561
definition: отряд или группа судов специального назначения
in scheme: ruthes
lexicalized sense: 3139-военная флотилия-ng-0
lexicalized sense: 3139-флотилия-n-0