НАСЛЕДНИК
type: LexicalConcept
holonym: http://lod.ruthes.org/resource/concept/3233
hypernym: http://lod.ruthes.org/resource/concept/305
hypernym: http://lod.ruthes.org/resource/concept/3231
hypernym: http://lod.ruthes.org/resource/concept/7648
hyponym: http://lod.ruthes.org/resource/concept/123358
definition: тот, кто получает наследство, имущество, оставшееся после умершего
in scheme: ruthes
lexicalized sense: 3234-наследник-n-0
lexicalized sense: 3234-наследница-n-0