РОЖДЕНИЕ РЕБЕНКА
type: LexicalConcept
association2: http://lod.ruthes.org/resource/concept/133821
association2: http://lod.ruthes.org/resource/concept/145584
association2: http://lod.ruthes.org/resource/concept/149216
association2: http://lod.ruthes.org/resource/concept/153869
association2: http://lod.ruthes.org/resource/concept/3586
association2: http://lod.ruthes.org/resource/concept/4449
association2: http://lod.ruthes.org/resource/concept/5139
association2: http://lod.ruthes.org/resource/concept/609
association2: http://lod.ruthes.org/resource/concept/6560
holonym: http://lod.ruthes.org/resource/concept/3225
hypernym: http://lod.ruthes.org/resource/concept/115010
meronym: http://lod.ruthes.org/resource/concept/113895
meronym: http://lod.ruthes.org/resource/concept/4935
meronym: http://lod.ruthes.org/resource/concept/8968
definition: день, число, когда кто-либо родился, а также празднование этого дня
in scheme: ruthes
lexicalized sense: 3235-детородный-adj-0
lexicalized sense: 3235-деторождение-n-0
lexicalized sense: 3235-рождение-n-0
lexicalized sense: 3235-рождение ребенка-ng-0
lexicalized sense: 3235-рождение человека-ng-0