ПОЛК
type: LexicalConcept
hypernym: http://lod.ruthes.org/resource/concept/2574
hyponym: http://lod.ruthes.org/resource/concept/137875
meronym: http://lod.ruthes.org/resource/concept/5337
definition: формирование вооружённых сил численностью от 900 до 2000 человек, включающее штаб и несколько батальонов или дивизионов (подразделений)
in scheme: ruthes
lexicalized sense: 3395-полк-n-0
lexicalized sense: 3395-полковой-adj-0