СЕКРЕТАРИАТ, КАНЦЕЛЯРИЯ
type: LexicalConcept
holonym: http://lod.ruthes.org/resource/concept/134675
holonym: http://lod.ruthes.org/resource/concept/140569
holonym: http://lod.ruthes.org/resource/concept/3624
hypernym: http://lod.ruthes.org/resource/concept/114757
definition: отдел учреждения, занятый делопроизводством, а также помещение этого отдела
in scheme: ruthes
lexicalized sense: 3625-канцелярия-n-0
lexicalized sense: 3625-канцелярский-adj-0
lexicalized sense: 3625-отдел делопроизводства-ng-0
lexicalized sense: 3625-секретариат-n-0