НАСЕЛЕНИЕ
type: LexicalConcept
association2: http://lod.ruthes.org/resource/concept/150320
association2: http://lod.ruthes.org/resource/concept/150482
association2: http://lod.ruthes.org/resource/concept/155114
association2: http://lod.ruthes.org/resource/concept/1905
association2: http://lod.ruthes.org/resource/concept/5944
association2: http://lod.ruthes.org/resource/concept/596
association2: http://lod.ruthes.org/resource/concept/602
association2: http://lod.ruthes.org/resource/concept/610
hypernym: http://lod.ruthes.org/resource/concept/138999
hyponym: http://lod.ruthes.org/resource/concept/105336
hyponym: http://lod.ruthes.org/resource/concept/106291
hyponym: http://lod.ruthes.org/resource/concept/124954
hyponym: http://lod.ruthes.org/resource/concept/126592
hyponym: http://lod.ruthes.org/resource/concept/126653
hyponym: http://lod.ruthes.org/resource/concept/128734
hyponym: http://lod.ruthes.org/resource/concept/129069
hyponym: http://lod.ruthes.org/resource/concept/129096
hyponym: http://lod.ruthes.org/resource/concept/130107
hyponym: http://lod.ruthes.org/resource/concept/132052
hyponym: http://lod.ruthes.org/resource/concept/132681
hyponym: http://lod.ruthes.org/resource/concept/134078
hyponym: http://lod.ruthes.org/resource/concept/134302
hyponym: http://lod.ruthes.org/resource/concept/139750
hyponym: http://lod.ruthes.org/resource/concept/140877
hyponym: http://lod.ruthes.org/resource/concept/141598
hyponym: http://lod.ruthes.org/resource/concept/141625
hyponym: http://lod.ruthes.org/resource/concept/142842
hyponym: http://lod.ruthes.org/resource/concept/144824
hyponym: http://lod.ruthes.org/resource/concept/144899
hyponym: http://lod.ruthes.org/resource/concept/148245
hyponym: http://lod.ruthes.org/resource/concept/148306
hyponym: http://lod.ruthes.org/resource/concept/148389
hyponym: http://lod.ruthes.org/resource/concept/149656
hyponym: http://lod.ruthes.org/resource/concept/1923
hyponym: http://lod.ruthes.org/resource/concept/2904
hyponym: http://lod.ruthes.org/resource/concept/4773
hyponym: http://lod.ruthes.org/resource/concept/582
hyponym: http://lod.ruthes.org/resource/concept/617
hyponym: http://lod.ruthes.org/resource/concept/618
hyponym: http://lod.ruthes.org/resource/concept/6643
hyponym: http://lod.ruthes.org/resource/concept/6726
hyponym: http://lod.ruthes.org/resource/concept/6727
hyponym: http://lod.ruthes.org/resource/concept/885
hyponym: http://lod.ruthes.org/resource/concept/9162
meronym: http://lod.ruthes.org/resource/concept/148247
meronym: http://lod.ruthes.org/resource/concept/1931
meronym: http://lod.ruthes.org/resource/concept/2367
meronym: http://lod.ruthes.org/resource/concept/2553
meronym: http://lod.ruthes.org/resource/concept/5074
meronym: http://lod.ruthes.org/resource/concept/6028
definition: совокупность жителей какой-либо области, местности и т. п.
in scheme: ruthes
lexicalized sense: 369-народ-n-0
lexicalized sense: 369-народонаселение-n-0
lexicalized sense: 369-население-n-0