ЗАКОН
type: LexicalConcept
association2: http://lod.ruthes.org/resource/concept/131360
association2: http://lod.ruthes.org/resource/concept/147267
association2: http://lod.ruthes.org/resource/concept/2064
association2: http://lod.ruthes.org/resource/concept/3673
association2: http://lod.ruthes.org/resource/concept/386
association2: http://lod.ruthes.org/resource/concept/4251
association2: http://lod.ruthes.org/resource/concept/5268
association2: http://lod.ruthes.org/resource/concept/695
hypernym: http://lod.ruthes.org/resource/concept/143982
hyponym: http://lod.ruthes.org/resource/concept/2223
definition: юридический акт, принятый высшим представительным органом государственной власти либо непосредственным волеизъявлением населения (в порядке референдума) и регулирующий, как правило, наиболее важные общественные отношения
in scheme: ruthes
lexicalized sense: 398-акт законодательства-ng-0
lexicalized sense: 398-закон-n-0
lexicalized sense: 398-законодательно-правовой-adj-0
lexicalized sense: 398-законодательно-правовой акт-ng-0
lexicalized sense: 398-законодательное решение-ng-0
lexicalized sense: 398-законодательный акт-ng-0
lexicalized sense: 398-законодательный документ-ng-0
lexicalized sense: 398-законоположение-n-0
lexicalized sense: 398-светский закон-ng-0