НОРМАТИВНЫЙ АКТ
type: LexicalConcept
association2: http://lod.ruthes.org/resource/concept/451
association2: http://lod.ruthes.org/resource/concept/7735
hypernym: http://lod.ruthes.org/resource/concept/1290
hyponym: http://lod.ruthes.org/resource/concept/106453
hyponym: http://lod.ruthes.org/resource/concept/141445
hyponym: http://lod.ruthes.org/resource/concept/143982
hyponym: http://lod.ruthes.org/resource/concept/2650
hyponym: http://lod.ruthes.org/resource/concept/386
hyponym: http://lod.ruthes.org/resource/concept/4208
meronym: http://lod.ruthes.org/resource/concept/1644
definition: служебный документ официально-делового стиля, составленный несколькими лицами и подтверждающий установленные факты и события
in scheme: ruthes
lexicalized sense: 411-акт-n-0
lexicalized sense: 411-акт нормативного характера-ng-0
lexicalized sense: 411-нормативно-законодательный-adj-0
lexicalized sense: 411-нормативное предписание-ng-0
lexicalized sense: 411-нормативный акт-ng-0
lexicalized sense: 411-нормативный документ-ng-0
lexicalized sense: 411-нормативный юридический акт-ng-0