ЗАКОНОТВОРЧЕСТВО
type: LexicalConcept
association1: http://lod.ruthes.org/resource/concept/386
association1: http://lod.ruthes.org/resource/concept/398
holonym: http://lod.ruthes.org/resource/concept/422
hypernym: http://lod.ruthes.org/resource/concept/7194
meronym: http://lod.ruthes.org/resource/concept/6679
meronym: http://lod.ruthes.org/resource/concept/695
definition: деятельность представительного (законодательного) органа государственной власти, связанная с выявлением потребности в принятии закона, его разработкой и принятием
in scheme: ruthes
lexicalized sense: 4251-законодательная деятельность-ng-0
lexicalized sense: 4251-законодательная работа-ng-0
lexicalized sense: 4251-законодательный-adj-0
lexicalized sense: 4251-законодательный процесс-ng-0
lexicalized sense: 4251-законодательствовать-v-0
lexicalized sense: 4251-законопроектная деятельность-ng-0
lexicalized sense: 4251-законопроектная работа-ng-0
lexicalized sense: 4251-законотворческая деятельность-ng-0
lexicalized sense: 4251-законотворческая работа-ng-0
lexicalized sense: 4251-законотворческий-adj-0
lexicalized sense: 4251-законотворческий процесс-ng-0
lexicalized sense: 4251-законотворчество-n-0
lexicalized sense: 4251-нормотворческая деятельность-ng-0
lexicalized sense: 4251-нормотворческая работа-ng-0
lexicalized sense: 4251-нормотворческий-adj-0
lexicalized sense: 4251-нормотворчество-n-0
lexicalized sense: 4251-правотворческая деятельность-ng-0
lexicalized sense: 4251-правотворческий-adj-0
lexicalized sense: 4251-правотворческий процесс-ng-0
lexicalized sense: 4251-правотворчество-n-0
lexicalized sense: 4251-разработка закона-ng-0
lexicalized sense: 4251-разработка законодательных актов-ng-0
lexicalized sense: 4251-разработка законодательства-ng-0
lexicalized sense: 4251-разработка законопроекта-ng-0