ДОЦЕНТ
type: LexicalConcept
hypernym: http://lod.ruthes.org/resource/concept/1386
hypernym: http://lod.ruthes.org/resource/concept/2147
definition: учёное звание преподавателей высших учебных заведений
in scheme: ruthes
lexicalized sense: 44-доцент-n-0
lexicalized sense: 44-доцент кафедры-ng-0
lexicalized sense: 44-доцентский-adj-0