РОДИЛЬНЫЙ ДОМ
type: LexicalConcept
association1: http://lod.ruthes.org/resource/concept/113895
association1: http://lod.ruthes.org/resource/concept/3235
holonym: http://lod.ruthes.org/resource/concept/5139
hypernym: http://lod.ruthes.org/resource/concept/113278
definition: специализированное медицинское учреждение, обеспечивающее квалифицированную медицинскую помощь женщинам во время беременности и родов, а также медицинскую помощь новорождённым
in scheme: ruthes
lexicalized sense: 4449-акушерский пункт-ng-0
lexicalized sense: 4449-роддом-n-0
lexicalized sense: 4449-роддомовский-adj-0
lexicalized sense: 4449-родильный дом-ng-0
lexicalized sense: 4449-родовспомогательное учреждение-ng-0
lexicalized sense: 4449-учреждение родовспоможения-ng-0