ПРОФИЛАКТИЧЕСКАЯ ПРИВИВКА
type: LexicalConcept
association1: http://lod.ruthes.org/resource/concept/1054
hypernym: http://lod.ruthes.org/resource/concept/111189
hypernym: http://lod.ruthes.org/resource/concept/2065
hypernym: http://lod.ruthes.org/resource/concept/7514
meronym: http://lod.ruthes.org/resource/concept/4032
definition: введение в чей-либо организм какого-либо препарата для профилактики заболеваний; вакцинация
in scheme: ruthes
lexicalized sense: 4521-вакцинация-n-0
lexicalized sense: 4521-вакцинировать-v-0
lexicalized sense: 4521-вакцинопрофилактика-n-0
lexicalized sense: 4521-прививать-v-0
lexicalized sense: 4521-прививаться-v-0
lexicalized sense: 4521-прививка-n-0
lexicalized sense: 4521-прививочный-adj-0
lexicalized sense: 4521-привить-v-0
lexicalized sense: 4521-привиться-v-0
lexicalized sense: 4521-профилактическая прививка-ng-0
lexicalized sense: 4521-ревакцинация-n-0