ДОКТОРАНТ
type: LexicalConcept
association1: http://lod.ruthes.org/resource/concept/22
holonym: http://lod.ruthes.org/resource/concept/3689
hypernym: http://lod.ruthes.org/resource/concept/129140
hypernym: http://lod.ruthes.org/resource/concept/21
definition: обладатель учёной степени кандидата наук, зачисленный в докторантуру для подготовки диссертации на получение научной степени доктора наук
in scheme: ruthes
lexicalized sense: 4775-докторант-n-0