НАЦИЗМ
type: LexicalConcept
hypernym: http://lod.ruthes.org/resource/concept/3144
meronym: http://lod.ruthes.org/resource/concept/113969
meronym: http://lod.ruthes.org/resource/concept/6795
definition: доктрина, сочетающая фашизм с расизмом; официальная идеология гитлеровской Германии
in scheme: ruthes
lexicalized sense: 4783-нацизм-n-0
lexicalized sense: 4783-нацистский-adj-0
lexicalized sense: 4783-пронацистский-n-0