ПОКУПАТЕЛЬ
type: LexicalConcept
association2: http://lod.ruthes.org/resource/concept/119509
association2: http://lod.ruthes.org/resource/concept/128342
association2: http://lod.ruthes.org/resource/concept/150289
holonym: http://lod.ruthes.org/resource/concept/3852
hypernym: http://lod.ruthes.org/resource/concept/138167
hypernym: http://lod.ruthes.org/resource/concept/144563
hypernym: http://lod.ruthes.org/resource/concept/2622
hyponym: http://lod.ruthes.org/resource/concept/123761
hyponym: http://lod.ruthes.org/resource/concept/139915
definition: тот, кто покупает что-либо, то есть целенаправленно приобретает в обмен на деньги или другие ценности
in scheme: ruthes
lexicalized sense: 4885-покупатель-n-0
lexicalized sense: 4885-покупательница-n-0
lexicalized sense: 4885-покупательский-adj-0