ТОТАЛИТАРНЫЙ РЕЖИМ
type: LexicalConcept
hypernym: http://lod.ruthes.org/resource/concept/124930
hyponym: http://lod.ruthes.org/resource/concept/124931
hyponym: http://lod.ruthes.org/resource/concept/139870
definition: устройство общества, при котором власть регулирует все стороны жизни граждан.
in scheme: ruthes
lexicalized sense: 4895-тоталитаризм-n-0
lexicalized sense: 4895-тоталитаристский-adj-0
lexicalized sense: 4895-тоталитарная система-ng-0
lexicalized sense: 4895-тоталитарность-n-0
lexicalized sense: 4895-тоталитарный-adj-0
lexicalized sense: 4895-тоталитарный режим-ng-0