МЛАДЕНЕЦ
type: LexicalConcept
association: http://lod.ruthes.org/resource/concept/8393
association2: http://lod.ruthes.org/resource/concept/108446
association2: http://lod.ruthes.org/resource/concept/127604
association2: http://lod.ruthes.org/resource/concept/128536
association2: http://lod.ruthes.org/resource/concept/130748
association2: http://lod.ruthes.org/resource/concept/131943
association2: http://lod.ruthes.org/resource/concept/145506
association2: http://lod.ruthes.org/resource/concept/145895
association2: http://lod.ruthes.org/resource/concept/3686
association2: http://lod.ruthes.org/resource/concept/3707
association2: http://lod.ruthes.org/resource/concept/9335
holonym: http://lod.ruthes.org/resource/concept/3235
hypernym: http://lod.ruthes.org/resource/concept/147301
hyponym: http://lod.ruthes.org/resource/concept/113175
hyponym: http://lod.ruthes.org/resource/concept/147488
meronym: http://lod.ruthes.org/resource/concept/134599
definition: чаще о детях до 1 года, недавно родившийся ребёнок, не способный к самостоятельному существованию и полностью зависящий от матери (или того, кто выполняет функции матери)
in scheme: ruthes
lexicalized sense: 4935-младенец-n-0
lexicalized sense: 4935-младенческий-adj-0