МОРГ
type: LexicalConcept
association2: http://lod.ruthes.org/resource/concept/8919
holonym: http://lod.ruthes.org/resource/concept/4193
hypernym: http://lod.ruthes.org/resource/concept/1037
definition: специальное помещение при больницах, судебно-медицинских учреждениях для хранения, опознания, вскрытия и выдачи трупов для захоронения
in scheme: ruthes
lexicalized sense: 5076-анатомический театр-ng-0
lexicalized sense: 5076-морг-n-0
lexicalized sense: 5076-покойницкая-n-0