ПРОГУЛ
type: LexicalConcept
hypernym: http://lod.ruthes.org/resource/concept/107592
hypernym: http://lod.ruthes.org/resource/concept/132945
meronym: http://lod.ruthes.org/resource/concept/128363
definition: неявка на работу, учебное занятие и т. п. без уважительной причины
in scheme: ruthes
lexicalized sense: 5167-прогул-n-0
lexicalized sense: 5167-прогуливать-v-0
lexicalized sense: 5167-прогулять-v-0