ВОЕННЫЙ ГАРНИЗОН
type: LexicalConcept
association1: http://lod.ruthes.org/resource/concept/792
association2: http://lod.ruthes.org/resource/concept/2866
association2: http://lod.ruthes.org/resource/concept/6956
hypernym: http://lod.ruthes.org/resource/concept/2574
meronym: http://lod.ruthes.org/resource/concept/124606
definition: воинские части, учреждения и т. п., расположенные в населённом пункте или районе
in scheme: ruthes
lexicalized sense: 5236-военный гарнизон-ng-0
lexicalized sense: 5236-воинский гарнизон-ng-0
lexicalized sense: 5236-гарнизон-n-0
lexicalized sense: 5236-гарнизонный-adj-0