РАЗБОЙ
type: LexicalConcept
association: http://lod.ruthes.org/resource/concept/7322
hypernym: http://lod.ruthes.org/resource/concept/113766
hypernym: http://lod.ruthes.org/resource/concept/135004
hypernym: http://lod.ruthes.org/resource/concept/4131
hyponym: http://lod.ruthes.org/resource/concept/8880
meronym: http://lod.ruthes.org/resource/concept/129440
definition: насильственное хищение чужого имущества; нападение с целью ограбления, сопровождаемое угрозами, насилием, иногда убийством
in scheme: ruthes
lexicalized sense: 5296-разбой-n-0
lexicalized sense: 5296-разбойничать-v-0
lexicalized sense: 5296-разбойное нападение-ng-0
lexicalized sense: 5296-разбойный-adj-0
lexicalized sense: 5296-разбойный налет-ng-0