КОТТЕДЖ
type: LexicalConcept
hypernym: http://lod.ruthes.org/resource/concept/133284
hypernym: http://lod.ruthes.org/resource/concept/3641
definition: небольшой благоустроенный жилой дом в пригороде, в посёлке и т. п., обычно одноэтажный или двухэтажный, предназначенный для одной семьи
in scheme: ruthes
lexicalized sense: 5324-дом коттеджного типа-ng-0
lexicalized sense: 5324-коттедж-n-0
lexicalized sense: 5324-коттеджный-adj-0
lexicalized sense: 5324-частный коттедж-ng-0