РЭКЕТ
type: LexicalConcept
hypernym: http://lod.ruthes.org/resource/concept/121428
hypernym: http://lod.ruthes.org/resource/concept/5190
definition: преступное вымогательство чужих доходов путём угроз и насилия
in scheme: ruthes
lexicalized sense: 5331-рэкет-n-0
lexicalized sense: 5331-рэкетировать-v-0
lexicalized sense: 5331-рэкетирский-adj-0
lexicalized sense: 5331-рэкетирство-n-0