БАТАЛЬОН
type: LexicalConcept
holonym: http://lod.ruthes.org/resource/concept/3395
hypernym: http://lod.ruthes.org/resource/concept/790
meronym: http://lod.ruthes.org/resource/concept/113924
meronym: http://lod.ruthes.org/resource/concept/5092
definition: базовая самостоятельная воинская единица численностью (в России) около 350-500 солдат, состоящая из нескольких рот
in scheme: ruthes
lexicalized sense: 5337-батальон-n-0
lexicalized sense: 5337-батальонный-adj-0