ПАЦИЕНТ
type: LexicalConcept
association2: http://lod.ruthes.org/resource/concept/1063
association2: http://lod.ruthes.org/resource/concept/127240
holonym: http://lod.ruthes.org/resource/concept/1062
hypernym: http://lod.ruthes.org/resource/concept/4846
hyponym: http://lod.ruthes.org/resource/concept/137388
definition: тот, кто обращается за медицинской помощью, находится под медицинским наблюдением, лечится у врача
in scheme: ruthes
lexicalized sense: 5417-пациент-n-0
lexicalized sense: 5417-пациентка-n-0