НАЛОГОВАЯ ЗАДОЛЖЕННОСТЬ
type: LexicalConcept
association1: http://lod.ruthes.org/resource/concept/1242
hypernym: http://lod.ruthes.org/resource/concept/130029
hypernym: http://lod.ruthes.org/resource/concept/6179
definition: не уплаченная в срок часть налога или какого-либо иного сбора (обычно рассматриваемые как дефицит бюджета)
in scheme: ruthes
lexicalized sense: 5421-долг перед бюджетом-ng-0
lexicalized sense: 5421-задолженность в бюджет-ng-0
lexicalized sense: 5421-задолженность по налогам-ng-0
lexicalized sense: 5421-задолженность по налоговым платежам-ng-0
lexicalized sense: 5421-налоговая задолженность-ng-0
lexicalized sense: 5421-налоговый неплатеж-ng-0
lexicalized sense: 5421-недоимка-n-0
lexicalized sense: 5421-неуплата налогов-ng-0
lexicalized sense: 5421-фискальная задолженность-ng-0