ВАХТОВАЯ БРИГАДА
type: LexicalConcept
association1: http://lod.ruthes.org/resource/concept/147900
hypernym: http://lod.ruthes.org/resource/concept/120633
hypernym: http://lod.ruthes.org/resource/concept/121719
definition: промежуток времени, в продолжение которого такую службу несёт одна смена
in scheme: ruthes
lexicalized sense: 5557-вахта-n-0
lexicalized sense: 5557-вахтовая бригада-ng-0
lexicalized sense: 5557-вахтовики-n-0