МЕДСЕСТРА
type: LexicalConcept
hypernym: http://lod.ruthes.org/resource/concept/7761
definition: работница лечебных учреждений, лицо среднего (прежде низшего) медицинского персонала, выполняющее медицинские или хозяйственный обязанности
in scheme: ruthes
lexicalized sense: 5758-медицинская сестра-ng-0
lexicalized sense: 5758-медсестра-n-0
lexicalized sense: 5758-медсестринский-adj-0
lexicalized sense: 5758-медсестричка-n-0
lexicalized sense: 5758-сестра милосердия-ng-0
lexicalized sense: 5758-сестринский-adj-0
lexicalized sense: 5758-сестричка-n-0