ТАМОЖЕННИК
type: LexicalConcept
holonym: http://lod.ruthes.org/resource/concept/1654
hypernym: http://lod.ruthes.org/resource/concept/3361
hypernym: http://lod.ruthes.org/resource/concept/6527
definition: сотрудник таможни, тот, кто работает на таможне
in scheme: ruthes
lexicalized sense: 6156-работник таможенной службы-ng-0
lexicalized sense: 6156-работник таможни-ng-0
lexicalized sense: 6156-сотрудник таможенного органа-ng-0
lexicalized sense: 6156-сотрудник таможенного управления-ng-0
lexicalized sense: 6156-сотрудник таможенной службы-ng-0
lexicalized sense: 6156-сотрудник таможни-ng-0
lexicalized sense: 6156-сотрудница таможни-ng-0
lexicalized sense: 6156-специалист таможенной службы-ng-0
lexicalized sense: 6156-специалист таможни-ng-0
lexicalized sense: 6156-таможенник-n-0
lexicalized sense: 6156-таможенница-n-0
lexicalized sense: 6156-таможенные кадры-ng-0
lexicalized sense: 6156-таможенный работник-ng-0
lexicalized sense: 6156-таможенный служащий-ng-0
lexicalized sense: 6156-таможенный сотрудник-ng-0
lexicalized sense: 6156-таможенный чиновник-ng-0