ТЕХНИКУМ
type: LexicalConcept
hypernym: http://lod.ruthes.org/resource/concept/143578
definition: среднее техническое или любое специальное профессиональное учебное заведение
in scheme: ruthes
lexicalized sense: 6364-политехникум-n-0
lexicalized sense: 6364-техникум-n-0