КОРЕННОЕ НАСЕЛЕНИЕ
type: LexicalConcept
hypernym: http://lod.ruthes.org/resource/concept/369
hyponym: http://lod.ruthes.org/resource/concept/124112
definition: автохтон; коренной обитатель той или иной территории или страны, живущий «изначально»
in scheme: ruthes
lexicalized sense: 6727-абориген-n-0
lexicalized sense: 6727-аборигенка-n-0
lexicalized sense: 6727-аборигенный-adj-0
lexicalized sense: 6727-автохтон-n-0
lexicalized sense: 6727-автохтонка-n-0
lexicalized sense: 6727-автохтонный-adj-0
lexicalized sense: 6727-коренное население-ng-0
lexicalized sense: 6727-коренной житель-ng-0
lexicalized sense: 6727-туземец-n-0
lexicalized sense: 6727-туземный-adj-0