МАТЬ
type: LexicalConcept
association2: http://lod.ruthes.org/resource/concept/121669
association2: http://lod.ruthes.org/resource/concept/130038
association2: http://lod.ruthes.org/resource/concept/150296
hypernym: http://lod.ruthes.org/resource/concept/132893
hypernym: http://lod.ruthes.org/resource/concept/2655
hyponym: http://lod.ruthes.org/resource/concept/136583
hyponym: http://lod.ruthes.org/resource/concept/3035
hyponym: http://lod.ruthes.org/resource/concept/8968
meronym: http://lod.ruthes.org/resource/concept/3225
definition: родительница, женщина по отношению к своим детям
in scheme: ruthes
lexicalized sense: 758-мама-n-0
lexicalized sense: 758-мамаша-n-0
lexicalized sense: 758-маменька-n-0
lexicalized sense: 758-мамочка-n-0
lexicalized sense: 758-мамуля-n-0
lexicalized sense: 758-материнский-adj-0
lexicalized sense: 758-матушка-n-0
lexicalized sense: 758-мать-n-0
lexicalized sense: 758-родительница-n-0