ПАТРИАРХ (ГЛАВА ЦЕРКВИ)
type: LexicalConcept
association2: http://lod.ruthes.org/resource/concept/143979
association2: http://lod.ruthes.org/resource/concept/2370
holonym: http://lod.ruthes.org/resource/concept/132173
hypernym: http://lod.ruthes.org/resource/concept/106115
definition: сан предстоятеля некоторых поместных Церквей.
in scheme: ruthes
lexicalized sense: 8028-патриарх-n-0
lexicalized sense: 8028-патриарший-adj-0
lexicalized sense: 8028-святейшество-n-0
lexicalized sense: 8028-церковный патриарх-ng-0