АПАРТЕИД
type: LexicalConcept
association1: http://lod.ruthes.org/resource/concept/105052
hypernym: http://lod.ruthes.org/resource/concept/120976
hypernym: http://lod.ruthes.org/resource/concept/137766
definition: принцип раздельного проживания представителей различных этнорасовых групп
in scheme: ruthes
lexicalized sense: 8098-апартеид-n-0
lexicalized sense: 8098-политика апартеида-ng-0