МОШЕННИК
type: LexicalConcept
holonym: http://lod.ruthes.org/resource/concept/5295
hypernym: http://lod.ruthes.org/resource/concept/111320
hypernym: http://lod.ruthes.org/resource/concept/639
hyponym: http://lod.ruthes.org/resource/concept/124119
hyponym: http://lod.ruthes.org/resource/concept/124265
hyponym: http://lod.ruthes.org/resource/concept/124726
definition: тот, кто обманывает других, злоупотребляя их доверием, в корыстных целях; жулик, плут
in scheme: ruthes
lexicalized sense: 8117-аферист-n-0
lexicalized sense: 8117-аферистка-n-0
lexicalized sense: 8117-аферистский-adj-0
lexicalized sense: 8117-махинатор-n-0
lexicalized sense: 8117-мошенник-n-0
lexicalized sense: 8117-мошенница-n-0
lexicalized sense: 8117-прощелыга-n-0