ТЕАТРАЛЬНАЯ ТРУППА
type: LexicalConcept
holonym: http://lod.ruthes.org/resource/concept/1441
hypernym: http://lod.ruthes.org/resource/concept/151819
hypernym: http://lod.ruthes.org/resource/concept/879
hyponym: http://lod.ruthes.org/resource/concept/132556
meronym: http://lod.ruthes.org/resource/concept/112300
meronym: http://lod.ruthes.org/resource/concept/146961
definition: учреждение, организация, устраивающее театральные представления
in scheme: ruthes
lexicalized sense: 8128-драматический коллектив-ng-0
lexicalized sense: 8128-коллектив театра-ng-0
lexicalized sense: 8128-сценический коллектив-ng-0
lexicalized sense: 8128-театр-n-0
lexicalized sense: 8128-театральная труппа-ng-0
lexicalized sense: 8128-театральный коллектив-ng-0
lexicalized sense: 8128-труппа театра-ng-0