ДЕМИЛИТАРИЗАЦИЯ
type: LexicalConcept
association1: http://lod.ruthes.org/resource/concept/125676
holonym: http://lod.ruthes.org/resource/concept/4440
hypernym: http://lod.ruthes.org/resource/concept/1527
hyponym: http://lod.ruthes.org/resource/concept/2169
definition: ликвидация военных укреплений и сооружений, а также запрет на содержание военных баз и войск в определённой зоне.
in scheme: ruthes
lexicalized sense: 8170-демилитаризация-n-0
lexicalized sense: 8170-демилитаризировать-v-0
lexicalized sense: 8170-демилитаризовать-v-0