ПАТРУЛЬ
type: LexicalConcept
holonym: http://lod.ruthes.org/resource/concept/3977
hypernym: http://lod.ruthes.org/resource/concept/153401
definition: участник патруля; тот, кто осуществляет патрулирование
in scheme: ruthes
lexicalized sense: 8238-группа патрулирования-ng-0
lexicalized sense: 8238-патруль-n-0
lexicalized sense: 8238-патрульная группа-ng-0
lexicalized sense: 8238-патрульный-adj-0