СУДЕБНО-МЕДИЦИНСКИЙ ЭКСПЕРТ
type: LexicalConcept
holonym: http://lod.ruthes.org/resource/concept/5572
hypernym: http://lod.ruthes.org/resource/concept/1045
definition: лицо, имеющее высшее немедицинское образование, получившее специальную подготовку по специальным методам исследования объектов судебно-медицинской экспертизы и занимающее штатную должность в учреждении судебно-медицинской экспертизы.
in scheme: ruthes
lexicalized sense: 8789-судебно-медицинский эксперт-ng-0
lexicalized sense: 8789-судмедэксперт-n-0