БЕЗРАБОТНЫЙ
type: LexicalConcept
holonym: http://lod.ruthes.org/resource/concept/134302
holonym: http://lod.ruthes.org/resource/concept/6643
holonym: http://lod.ruthes.org/resource/concept/861
hypernym: http://lod.ruthes.org/resource/concept/2149
hypernym: http://lod.ruthes.org/resource/concept/4069
hypernym: http://lod.ruthes.org/resource/concept/8515
hyponym: http://lod.ruthes.org/resource/concept/130930
definition: человек, который в какой-либо момент не находит применения своему труду, лишен работы, заработка
in scheme: ruthes
lexicalized sense: 880-без работы-prepg-0
lexicalized sense: 880-безработное лицо-ng-0
lexicalized sense: 880-безработное население-ng-0
lexicalized sense: 880-безработный-adj-0
lexicalized sense: 880-безработный гражданин-ng-0
lexicalized sense: 880-нетрудоустроенный-adj-0