УЧАСТНИК ВООРУЖЕННОГО ФОРМИРОВАНИЯ
type: LexicalConcept
holonym: http://lod.ruthes.org/resource/concept/3560
hypernym: http://lod.ruthes.org/resource/concept/106857
hypernym: http://lod.ruthes.org/resource/concept/2149
hyponym: http://lod.ruthes.org/resource/concept/124283
hyponym: http://lod.ruthes.org/resource/concept/9441
definition: член вооруженной террористической группировки
in scheme: ruthes
lexicalized sense: 8831-боевик-n-0
lexicalized sense: 8831-участник бандгруппы-ng-0
lexicalized sense: 8831-участник бандитского формирования-ng-0
lexicalized sense: 8831-участник бандформирования-ng-0
lexicalized sense: 8831-участник вооруженного формирования-ng-0
lexicalized sense: 8831-участник незаконного вооруженного формирования-ng-0
lexicalized sense: 8831-член бандформирования-ng-0
lexicalized sense: 8831-член вооруженного формирования-ng-0
lexicalized sense: 8831-член незаконного вооруженного формирования-ng-0