ПОЛИТИЧЕСКИЙ БЕЖЕНЕЦ
type: LexicalConcept
association2: http://lod.ruthes.org/resource/concept/9069
holonym: http://lod.ruthes.org/resource/concept/136011
hypernym: http://lod.ruthes.org/resource/concept/2790
definition: от политический эмигрант; тот, кто покидает родину и живёт за границей в силу политических причин
in scheme: ruthes
lexicalized sense: 9389-политический беженец-ng-0
lexicalized sense: 9389-политический эмигрант-ng-0
lexicalized sense: 9389-политэмигрант-n-0