ВАНДАЛИЗМ
type: LexicalConcept
hypernym: http://lod.ruthes.org/resource/concept/115213
hypernym: http://lod.ruthes.org/resource/concept/137718
hypernym: http://lod.ruthes.org/resource/concept/7334
definition: способ действия вандалов, разграбивших Рим в 450 году н.э. под начальством Гейзериха; варварство
in scheme: ruthes
lexicalized sense: 9418-вандализм-n-0
lexicalized sense: 9418-вандалистский-adj-0