ОСКОРБЛЕНИЕ
type: LexicalConcept
association2: http://lod.ruthes.org/resource/concept/130579
holonym: http://lod.ruthes.org/resource/concept/115208
hypernym: http://lod.ruthes.org/resource/concept/111260
hypernym: http://lod.ruthes.org/resource/concept/9426
hyponym: http://lod.ruthes.org/resource/concept/121313
definition: унижение чести и достоинства, выраженное в неприличной форме
in scheme: ruthes
lexicalized sense: 9427-оскорбление-n-0