КОМПЬЮТЕРНЫЙ ВИРУС
type: LexicalConcept
association2: http://lod.ruthes.org/resource/concept/10261
holonym: http://lod.ruthes.org/resource/concept/153570
hypernym: http://lod.ruthes.org/resource/concept/132058
definition: разновидность самовоспроизводящихся компьютерных программ, которые распространяются, внедряя себя в исполняемый код других программ или в документы специального формата
in scheme: ruthes
lexicalized sense: 9437-вирус-n-0
lexicalized sense: 9437-вирусный-adj-0
lexicalized sense: 9437-компьютерный вирус-ng-0
lexicalized sense: 9437-программа вируса-ng-0
lexicalized sense: 9437-программный вирус-ng-0