ТИРАЖ ПЕЧАТНОГО ИЗДАНИЯ
type: LexicalConcept
association1: http://lod.ruthes.org/resource/concept/4142
association2: http://lod.ruthes.org/resource/concept/135119
holonym: http://lod.ruthes.org/resource/concept/5931
hypernym: http://lod.ruthes.org/resource/concept/106515
definition: общее количество экземпляров печатающегося, выпускаемого издания
in scheme: ruthes
lexicalized sense: 9671-печатный тираж-ng-0
lexicalized sense: 9671-тираж-n-0
lexicalized sense: 9671-тираж издания-ng-0
lexicalized sense: 9671-тираж печатного издания-ng-0
lexicalized sense: 9671-тиражность-n-0
lexicalized sense: 9671-тиражный-adj-0